BDBM190521 US9181182, 46
SMILES CCCOc1ccc(cc1N)-c1nc(no1)-c1cccc2N(CC(N)(CO)CO)CCc12
InChI Key InChIKey=JUVBEQPRSJAOTR-UHFFFAOYSA-N
Data  1 EC50
  Tab Delimited (TSV)   2D SDfile   Computed 3D by Vconf -m prep SDfile
Find this compound or compounds like it in BindingDB:
Activity Spreadsheet -- Enzyme Inhibition Constant Data from BindingDB
Found 1 hit for monomerid = 190521
TargetSphingosine 1-phosphate receptor 1(Homo sapiens (Human))
Akaal Pharma
US Patent
LigandPNGBDBM190521(US9181182, 46)
Affinity DataEC50:  88nMT: 2°C. Assay description: Selected Compounds of the Examples were evaluated at Millipore Corporation, USA, using S1P1 receptor; [35S]-GTPgamaS binding assay. A [35S]-GTPgamaS ...
In DepthDetails US Patent