BDBM190892 US10077266, Example 3::US9181249, 3::US9708313, 3
SMILES CC(C)Nc1nc2CN(CCc2nc1N1CCC(CC1)Oc1ccc(F)cc1F)S(C)(=O)=O
InChI Key InChIKey=ZQSQANVLMIZGFW-UHFFFAOYSA-N
Data  3 IC50
  Tab Delimited (TSV)   2D SDfile   Computed 3D by Vconf -m prep SDfile
Find this compound or compounds like it in BindingDB:
Activity Spreadsheet -- Enzyme Inhibition Constant Data from BindingDB
Found 3 hits for monomerid = 190892
TargetG-protein coupled receptor 6(Homo sapiens (Human))
Takeda Pharmaceutical
US Patent
LigandPNGBDBM190892(US10077266, Example 3 | US9181249, 3 | US9708313, ...)
Affinity DataIC50:  0.0618nM. Assay description: This cell based assay measures the ability of compounds to inhibit the constitutive cAMP activity of GPR6 receptor expressed in CHO-K1 cells. CHO cel...
In DepthDetails US Patent
TargetG-protein coupled receptor 6(Homo sapiens (Human))
Takeda Pharmaceutical
US Patent
LigandPNGBDBM190892(US10077266, Example 3 | US9181249, 3 | US9708313, ...)
Affinity DataIC50:  6.18E+4nM. Assay description: This cell based assay measures the ability of compounds to inhibit the constitutive cAMP activity of GPR6 receptor expressed in CHO-K1 cells. CHO cel...
In DepthDetails US Patent
TargetG-protein coupled receptor 6(Homo sapiens (Human))
Takeda Pharmaceutical
US Patent
LigandPNGBDBM190892(US10077266, Example 3 | US9181249, 3 | US9708313, ...)
Affinity DataIC50:  6.18E+4nM. Assay description: This cell based assay measures the ability of compounds to inhibit the constitutive cAMP activity of GPR6 receptor expressed in CHO-K1 cells. CHO cel...
In DepthDetails US Patent