BDBM191027 US10077266, Example 139::US9181249, 139::US9708313, 139
SMILES CC(=O)O[C@@H]1C[C@@H](C1)Nc1nc2CN(CCc2nc1N1CCN(Cc2ccc(F)cc2F)CC1)C(C)=O
InChI Key InChIKey=JVADGRPSAFEECF-OYRHEFFESA-N
Data  3 IC50
  Tab Delimited (TSV)   2D SDfile   Computed 3D by Vconf -m prep SDfile
Find this compound or compounds like it in BindingDB:
Activity Spreadsheet -- Enzyme Inhibition Constant Data from BindingDB
Found 3 hits for monomerid = 191027
TargetG-protein coupled receptor 6(Homo sapiens (Human))
Takeda Pharmaceutical
US Patent
LigandPNGBDBM191027(US10077266, Example 139 | US9181249, 139 | US97083...)
Affinity DataIC50:  0.220nM. Assay description: This cell based assay measures the ability of compounds to inhibit the constitutive cAMP activity of GPR6 receptor expressed in CHO-K1 cells. CHO cel...
In DepthDetails US Patent
TargetG-protein coupled receptor 6(Homo sapiens (Human))
Takeda Pharmaceutical
US Patent
LigandPNGBDBM191027(US10077266, Example 139 | US9181249, 139 | US97083...)
Affinity DataIC50:  2.20E+5nM. Assay description: This cell based assay measures the ability of compounds to inhibit the constitutive cAMP activity of GPR6 receptor expressed in CHO-K1 cells. CHO cel...
In DepthDetails US Patent
TargetG-protein coupled receptor 6(Homo sapiens (Human))
Takeda Pharmaceutical
US Patent
LigandPNGBDBM191027(US10077266, Example 139 | US9181249, 139 | US97083...)
Affinity DataIC50:  2.20E+5nM. Assay description: This cell based assay measures the ability of compounds to inhibit the constitutive cAMP activity of GPR6 receptor expressed in CHO-K1 cells. CHO cel...
In DepthDetails US Patent