BDBM191040 US10077266, Example 152::US9181249, 152::US9708313, 152
SMILES CS(=O)(=O)N1CCc2nc(N3CCC(CC3)Oc3ccc(F)cc3F)c(NC3CCC3)nc2C1
InChI Key InChIKey=RJZHGBONFGIONP-UHFFFAOYSA-N
Data  3 IC50
  Tab Delimited (TSV)   2D SDfile   Computed 3D by Vconf -m prep SDfile
Find this compound or compounds like it in BindingDB:
Activity Spreadsheet -- Enzyme Inhibition Constant Data from BindingDB
Found 3 hits for monomerid = 191040
TargetG-protein coupled receptor 6(Homo sapiens (Human))
Takeda Pharmaceutical
US Patent
LigandPNGBDBM191040(US10077266, Example 152 | US9181249, 152 | US97083...)
Affinity DataIC50:  0.0493nM. Assay description: This cell based assay measures the ability of compounds to inhibit the constitutive cAMP activity of GPR6 receptor expressed in CHO-K1 cells. CHO cel...
In DepthDetails US Patent
TargetG-protein coupled receptor 6(Homo sapiens (Human))
Takeda Pharmaceutical
US Patent
LigandPNGBDBM191040(US10077266, Example 152 | US9181249, 152 | US97083...)
Affinity DataIC50:  4.93E+4nM. Assay description: This cell based assay measures the ability of compounds to inhibit the constitutive cAMP activity of GPR6 receptor expressed in CHO-K1 cells. CHO cel...
In DepthDetails US Patent
TargetG-protein coupled receptor 6(Homo sapiens (Human))
Takeda Pharmaceutical
US Patent
LigandPNGBDBM191040(US10077266, Example 152 | US9181249, 152 | US97083...)
Affinity DataIC50:  4.93E+4nM. Assay description: This cell based assay measures the ability of compounds to inhibit the constitutive cAMP activity of GPR6 receptor expressed in CHO-K1 cells. CHO cel...
In DepthDetails US Patent