BDBM191146 US9181266, 8
SMILES COc1ccc(cc1)C(=O)C1CCN(CC(=O)N(CC2CC2)Cc2nc3CCCCc3c(=O)[nH]2)CC1
InChI Key InChIKey=JAQISDRQXHHOJS-UHFFFAOYSA-N
Data  4 IC50
  Tab Delimited (TSV)   2D SDfile   Computed 3D by Vconf -m prep SDfile
Find this compound or compounds like it in BindingDB:
Activity Spreadsheet -- Enzyme Inhibition Constant Data from BindingDB
Found 4 hits for monomerid = 191146
TargetPoly [ADP-ribose] polymerase tankyrase-1(Homo sapiens (Human))
Novartis
US Patent
LigandPNGBDBM191146(US9181266, 8)
Affinity DataIC50:  31nMT: 2°C. Assay description: The autoparsylation activity of the TNKS 1/2 or PARP1/2 enzymes was measured by the liquid chromatography-mass spectrometry (LC/MS) detection of nico...
In DepthDetails US Patent
TargetPoly [ADP-ribose] polymerase 2(Homo sapiens (Human))
Novartis
US Patent
LigandPNGBDBM191146(US9181266, 8)
Affinity DataIC50:  9.14E+3nMT: 2°C. Assay description: The autoparsylation activity of the TNKS 1/2 or PARP1/2 enzymes was measured by the liquid chromatography-mass spectrometry (LC/MS) detection of nico...
In DepthDetails US Patent
TargetPoly [ADP-ribose] polymerase 1(Homo sapiens (Human))
Novartis
US Patent
LigandPNGBDBM191146(US9181266, 8)
Affinity DataIC50:  1.64E+4nMT: 2°C. Assay description: The autoparsylation activity of the TNKS 1/2 or PARP1/2 enzymes was measured by the liquid chromatography-mass spectrometry (LC/MS) detection of nico...
In DepthDetails US Patent
TargetPoly [ADP-ribose] polymerase tankyrase-2(Homo sapiens (Human))
Novartis
US Patent
LigandPNGBDBM191146(US9181266, 8)
Affinity DataIC50:  16nMT: 2°C. Assay description: The autoparsylation activity of the TNKS 1/2 or PARP1/2 enzymes was measured by the liquid chromatography-mass spectrometry (LC/MS) detection of nico...
In DepthDetails US Patent