BDBM191250 US9181272, 20
SMILES Cc1cncc(c1)-c1cnc2N(CCCc2c1)C(N)=O
InChI Key InChIKey=BVKIVVLUVAWVFD-UHFFFAOYSA-N
Data  1 IC50
  Tab Delimited (TSV)   2D SDfile   Computed 3D by Vconf -m prep SDfile
Find this compound or compounds like it in BindingDB:
Activity Spreadsheet -- Enzyme Inhibition Constant Data from BindingDB
Found 1 hit for monomerid = 191250
TargetCytochrome P450 family 11 subfamily B member 2(Cercopithecus sabaeus)
Boehringer Ingelheim International
US Patent
LigandPNGBDBM191250(US9181272, 20)
Affinity DataIC50:  2nMpH: 7.4Assay Description:The aldosterone synthase inhibition assay employs cynomolgus adrenal gland mitochondria as the source of aldosterone synthase (CYP11B2). Mitochondr...
In DepthDetails US Patent