BDBM191520 US9181272, 290
SMILES NC(=O)N1CCc2cc(cnc12)-c1cnccc1C#N
InChI Key InChIKey=OEDFXKWAQOEODA-UHFFFAOYSA-N
Data  1 IC50
  Tab Delimited (TSV)   2D SDfile   Computed 3D by Vconf -m prep SDfile
Find this compound or compounds like it in BindingDB:
Activity Spreadsheet -- Enzyme Inhibition Constant Data from BindingDB
Found 1 hit for monomerid = 191520
TargetCytochrome P450 family 11 subfamily B member 2(Cercopithecus sabaeus)
Boehringer Ingelheim International
US Patent
LigandPNGBDBM191520(US9181272, 290)
Affinity DataIC50:  9.10nMpH: 7.4Assay Description:The aldosterone synthase inhibition assay employs cynomolgus adrenal gland mitochondria as the source of aldosterone synthase (CYP11B2). Mitochondr...
In DepthDetails US Patent