BDBM191565 5-(4-fluorophenyl)-2-((phenylamino)methyl)-6,7-dihydropyrazolo[1,5-a]pyrazin-4(5h)-one::US9676782, 2
SMILES Fc1ccc(cc1)N1CCn2nc(CNc3ccccc3)cc2C1=O
InChI Key InChIKey=PIIQMOGEYKAOMN-UHFFFAOYSA-N
Data  2 IC50
  Tab Delimited (TSV)   2D SDfile   Computed 3D by Vconf -m prep SDfile
Find this compound or compounds like it in BindingDB:
Activity Spreadsheet -- Enzyme Inhibition Constant Data from BindingDB
Found 2 hits for monomerid = 191565
TargetMetabotropic glutamate receptor 5(Rattus norvegicus (Rat))
Vanderbilt University
US Patent
LigandPNGBDBM191565(5-(4-fluorophenyl)-2-((phenylamino)methyl)-6,7-dih...)
Affinity DataIC50:  2.04E+3nMT: 2°C. Assay description: Gα15/TREx cells stably expressing rat mGlu3 were plated in black-walled, clear-bottomed, poly-D-lysine coated 384-well plates in 20 μL of a...
Ligand InfoPC cidPC sid
In DepthDetails US Patent
TargetMetabotropic glutamate receptor 3(Rattus norvegicus (Rat))
Vanderbilt University
US Patent
LigandPNGBDBM191565(5-(4-fluorophenyl)-2-((phenylamino)methyl)-6,7-dih...)
Affinity DataIC50:  1.32E+3nMT: 2°C. Assay description: HEK 293A cells stably expressing rat mGlu5 were plated in black-walled, clear-bottomed, poly-D-lysine coated 384-well plates in 20 μL of assay m...
Ligand InfoPC cidPC sid
In DepthDetails US Patent