BDBM191610 US9181263, 4::US9278100, 4
SMILES Nc1ncnc2n(nc(-c3ccc(Oc4ccccc4)cc3)c12)C1CCCN(C1)C(=O)\C=C\c1c[nH]cn1
InChI Key
Data  4 IC50
  Tab Delimited (TSV)   2D SDfile   Computed 3D by Vconf -m prep SDfile
Find this compound or compounds like it in BindingDB:
Activity Spreadsheet -- Enzyme Inhibition Constant Data from BindingDB
Found 4 hits for monomerid = 191610
TargetTyrosine-protein kinase BTK(Homo sapiens (Human))
Pharmacyclics
US Patent
LigandPNGBDBM191610(US9181263, 4 | US9278100, 4)
Affinity DataIC50:  22.2nM. Assay description: IC50s were determined using the in vitro HotSpot kinase assay (purified enzymes, 33P-ATP, an appropriate substrate and 1 μM ATP.). For enzyme in...
In DepthDetails US Patent
TargetEpidermal growth factor receptor(Homo sapiens (Human))
Pharmacyclics
US Patent
LigandPNGBDBM191610(US9181263, 4 | US9278100, 4)
Affinity DataIC50:  488nM. Assay description: IC50s were determined using the in vitro HotSpot kinase assay (purified enzymes, 33P-ATP, an appropriate substrate and 1 uM ATP.). Reaction condition...
In DepthDetails US Patent
TargetTyrosine-protein kinase BTK(Homo sapiens (Human))
Pharmacyclics
US Patent
LigandPNGBDBM191610(US9181263, 4 | US9278100, 4)
Affinity DataIC50:  22.2nM. Assay description: IC50s were determined using the in vitro HotSpot kinase assay (purified enzymes, 33P-ATP, an appropriate substrate and 1 uM ATP.). Reaction condition...
In DepthDetails US Patent
TargetEpidermal growth factor receptor(Homo sapiens (Human))
Pharmacyclics
US Patent
LigandPNGBDBM191610(US9181263, 4 | US9278100, 4)
Affinity DataIC50:  488nM. Assay description: IC50s were determined using the in vitro HotSpot kinase assay (purified enzymes, 33P-ATP, an appropriate substrate and 1 μM ATP.). For enzyme in...
In DepthDetails US Patent