BDBM191663 US9186360, 104
SMILES Cn1c2oc(Cl)c(CC(=O)Nc3nc(cs3)-c3ccc(c(F)c3F)C(F)(F)F)c2c(=O)n(C)c1=O
InChI Key InChIKey=ZVSPWYGMKXWYHG-UHFFFAOYSA-N
Data  2 IC50
  Tab Delimited (TSV)   2D SDfile   Computed 3D by Vconf -m prep SDfile
Find this compound or compounds like it in BindingDB:
Activity Spreadsheet -- Enzyme Inhibition Constant Data from BindingDB
Found 2 hits for monomerid = 191663
TargetTransient receptor potential cation channel subfamily V member 4(Homo sapiens (Human))
Glenmark Pharmaceuticals
US Patent
LigandPNGBDBM191663(US9186360, 104)
Affinity DataIC50:  1.81E+3nMT: 2°C. Assay description: The inhibition of TRPA1 receptor activation was measured as inhibition of allylisothiocyanate (AITC) induced cellular uptake of radioactive calcium. ...
In DepthDetails US Patent
TargetTransient receptor potential cation channel subfamily A member 1(Homo sapiens (Human))
Glenmark Pharmaceuticals
US Patent
LigandPNGBDBM191663(US9186360, 104)
Affinity DataIC50:  7.58nMT: 2°C. Assay description: The inhibition of TRPA1 receptor activation was measured as inhibition of allylisothiocyanate (AITC) induced cellular uptake of radioactive calcium. ...
In DepthDetails US Patent