BDBM19167 3-(phenoxymethyl)-5H-indeno[1,2-c]pyridazin-5-one::Aza-heterocyclic Derivative, 1e
SMILES O=C1c2ccccc2-c2nnc(COc3ccccc3)cc12
InChI Key InChIKey=FYSBXMGLLLBKBR-UHFFFAOYSA-N
Data  1 IC50  1 Other
  Tab Delimited (TSV)   2D SDfile   Computed 3D by Vconf -m prep SDfile
Find this compound or compounds like it in BindingDB:
Activity Spreadsheet -- Enzyme Inhibition Constant Data from BindingDB
Found 2 hits for monomerid = 19167
TargetAmine oxidase [flavin-containing] B(Rattus norvegicus (rat))
University Of Bari
LigandPNGBDBM19167(3-(phenoxymethyl)-5H-indeno[1,2-c]pyridazin-5-one ...)
Affinity DataIC50:  2.51E+3nM. Assay description: A continuous spectrophotometric assay that monitors the rate of oxidation of the nonselective MAO substrate kynuramine into 4-hydroxyquinoline was us...
In DepthDetails ArticlePubMed
TargetAmine oxidase [flavin-containing] A(Rattus norvegicus (rat))
University Of Bari
LigandPNGBDBM19167(3-(phenoxymethyl)-5H-indeno[1,2-c]pyridazin-5-one ...)
Affinity DatapH: 7.4 T: 2°C. Assay description: A continuous spectrophotometric assay that monitors the rate of oxidation of the nonselective MAO substrate kynuramine into 4-hydroxyquinoline was us...
In DepthDetails ArticlePubMed