BDBM191712 US9186360, 59
SMILES Cn1c2occ(CC(=O)Nc3nc(cs3)-c3cccc(c3F)C(F)(F)F)c2c(=O)n(C)c1=O
InChI Key InChIKey=MSQPVCFZSCZFMD-UHFFFAOYSA-N
Data  5 IC50
  Tab Delimited (TSV)   2D SDfile   Computed 3D by Vconf -m prep SDfile
Find this compound or compounds like it in BindingDB:
Activity Spreadsheet -- Enzyme Inhibition Constant Data from BindingDB
Found 5 hits for monomerid = 191712
TargetTransient receptor potential cation channel subfamily A member 1(Homo sapiens (Human))
Glenmark Pharmaceuticals
US Patent
LigandPNGBDBM191712(US9186360, 59)
Affinity DataIC50:  2.21nMT: 2°C. Assay description: The inhibition of TRPA1 receptor activation was measured as inhibition of allylisothiocyanate (AITC) induced cellular uptake of radioactive calcium. ...
In DepthDetails US Patent
TargetTransient receptor potential cation channel subfamily V member 1(Homo sapiens (Human))
Glenmark Pharmaceuticals
US Patent
LigandPNGBDBM191712(US9186360, 59)
Affinity DataIC50: >1.00E+4nMT: 2°C. Assay description: The inhibition of TRPA1 receptor activation was measured as inhibition of allylisothiocyanate (AITC) induced cellular uptake of radioactive calcium. ...
In DepthDetails US Patent
TargetTransient receptor potential cation channel subfamily M member 8(Homo sapiens (Human))
Glenmark Pharmaceuticals
US Patent
LigandPNGBDBM191712(US9186360, 59)
Affinity DataIC50: >1.00E+4nMT: 2°C. Assay description: The inhibition of TRPA1 receptor activation was measured as inhibition of allylisothiocyanate (AITC) induced cellular uptake of radioactive calcium. ...
In DepthDetails US Patent
TargetTransient receptor potential cation channel subfamily V member 4(Homo sapiens (Human))
Glenmark Pharmaceuticals
US Patent
LigandPNGBDBM191712(US9186360, 59)
Affinity DataIC50:  2.83E+3nMT: 2°C. Assay description: The inhibition of TRPA1 receptor activation was measured as inhibition of allylisothiocyanate (AITC) induced cellular uptake of radioactive calcium. ...
In DepthDetails US Patent
TargetTransient receptor potential cation channel subfamily V member 3(Homo sapiens (Human))
Glenmark Pharmaceuticals
US Patent
LigandPNGBDBM191712(US9186360, 59)
Affinity DataIC50: >1.00E+3nMT: 2°C. Assay description: The inhibition of TRPA1 receptor activation was measured as inhibition of allylisothiocyanate (AITC) induced cellular uptake of radioactive calcium. ...
In DepthDetails US Patent