BDBM192010 Inz-1
SMILES COC(=O)Cn1nc(-c2ccccc2)c2ccccc12
InChI Key InChIKey=RBYOCUDWQCQSAM-UHFFFAOYSA-N
Data  2 IC50
  Tab Delimited (TSV)   2D SDfile   Computed 3D by Vconf -m prep SDfile
Find this compound or compounds like it in BindingDB:
Activity Spreadsheet -- Enzyme Inhibition Constant Data from BindingDB
Found 2 hits for monomerid = 192010
TargetCytochrome b(Candida albicans (Yeast))
Massachusetts Institute Of Technology
LigandPNGBDBM192010(Inz-1)
Affinity DataIC50:  8.09E+3nMpH: 7.4 T: 2°C. Assay description: The cytochrome b enzyme assay was adapted from previous studies (Gutierrez-Cirlos et al., 2004). Briefly, compounds were diluted in a 23 reaction buf...
In DepthDetails ArticlePubMed
TargetCytochrome b(Homo sapiens (Human))
Massachusetts Institute Of Technology
LigandPNGBDBM192010(Inz-1)
Affinity DataIC50:  4.53E+4nMpH: 7.4 T: 2°C. Assay description: The cytochrome b enzyme assay was adapted from previous studies (Gutierrez-Cirlos et al., 2004). Briefly, compounds were diluted in a 23 reaction buf...
In DepthDetails ArticlePubMed