BDBM192039 Inz-30
SMILES C(c1nccs1)n1nc(-c2ccccc2)c2ccccc12
InChI Key InChIKey=CLBRSOBREYPBFR-UHFFFAOYSA-N
Data  2 IC50
  Tab Delimited (TSV)   2D SDfile   Computed 3D by Vconf -m prep SDfile
Find this compound or compounds like it in BindingDB:
Activity Spreadsheet -- Enzyme Inhibition Constant Data from BindingDB
Found 2 hits for monomerid = 192039
TargetCytochrome b(Candida albicans (Yeast))
Massachusetts Institute Of Technology
LigandPNGBDBM192039(Inz-30)
Affinity DataIC50: >6.40E+4nMpH: 7.4 T: 2°C. Assay description: The cytochrome b enzyme assay was adapted from previous studies (Gutierrez-Cirlos et al., 2004). Briefly, compounds were diluted in a 23 reaction buf...
Ligand InfoPC cidPC sid
In DepthDetails ArticlePubMed
TargetCytochrome b(Homo sapiens (Human))
Massachusetts Institute Of Technology
LigandPNGBDBM192039(Inz-30)
Affinity DataIC50: >6.40E+4nMpH: 7.4 T: 2°C. Assay description: The cytochrome b enzyme assay was adapted from previous studies (Gutierrez-Cirlos et al., 2004). Briefly, compounds were diluted in a 23 reaction buf...
Ligand InfoPC cidPC sid
In DepthDetails ArticlePubMed