BDBM192182 US9187441, 9q
SMILES C[C@@H](N(C=O)C(C(=O)NC(C)(C)C)c1c([nH]c2cc(Cl)ccc12)C(O)=O)c1ccc(Cl)cc1
InChI Key
Data  1 KI
  Tab Delimited (TSV)   2D SDfile   Computed 3D by Vconf -m prep SDfile
Find this compound or compounds like it in BindingDB:
Activity Spreadsheet -- Enzyme Inhibition Constant Data from BindingDB
Found 1 hit for monomerid = 192182
TargetE3 ubiquitin-protein ligase Mdm2(Homo sapiens (Human))
University Of Pittsburgh
US Patent
LigandPNGBDBM192182(US9187441, 9q)
Affinity DataKi:  900nM ΔG°:  -8.10kcal/moleT: 2°C. Assay description: Fluorescent polarization experiments were performed as follows. Briefly, the fluorescence polarization experiments were read on an Ultra Evolution 38...
In DepthDetails US Patent