BDBM192197 US9187441, 6F
SMILES CCOC(=O)c1[nH]c2cc(Cl)ccc2c1C(N(Cc1ccc(F)cc1F)C=O)C(=O)NC(C)(C)C
InChI Key
Data  1 KI
  Tab Delimited (TSV)   2D SDfile   Computed 3D by Vconf -m prep SDfile
Find this compound or compounds like it in BindingDB:
Activity Spreadsheet -- Enzyme Inhibition Constant Data from BindingDB
Found 1 hit for monomerid = 192197
TargetE3 ubiquitin-protein ligase Mdm2(Homo sapiens (Human))
University Of Pittsburgh
US Patent
LigandPNGBDBM192197(US9187441, 6F)
Affinity DataKi:  6nM ΔG°:  -11.0kcal/moleT: 2°C. Assay description: Fluorescent polarization experiments were performed as follows. Briefly, the fluorescence polarization experiments were read on an Ultra Evolution 38...
In DepthDetails US Patent