BDBM192287 US9187450, 37
SMILES C[C@H](O)COc1cnc(nc1)N1CCC(CC1)c1nc2CC(C)(C)C[C@H](O)c2c(C2CCC(F)(F)CC2)c1[C@@H](F)c1ccc(cc1)C(F)(F)F
InChI Key InChIKey=XKPAIDSFDIJJKP-PGRZUCIQSA-N
Data  1 IC50
  Tab Delimited (TSV)   2D SDfile   Computed 3D by Vconf -m prep SDfile
Find this compound or compounds like it in BindingDB:
Activity Spreadsheet -- Enzyme Inhibition Constant Data from BindingDB
Found 1 hit for monomerid = 192287
TargetCholesteryl ester transfer protein(Homo sapiens (Human))
Daiichi Sankyo
US Patent
LigandPNGBDBM192287(US9187450, 37)
Affinity DataIC50:  25nMT: 2°C. Assay description: A recombinant human CETP protein (manufactured by Roar Biomedical Inc.; 4.5 ng), the acceptor lipoprotein described in (2) above (32.5 ug) and 5,5'...
In DepthDetails US Patent