BDBM192302 US9187450, 48
SMILES CC1(C)C[C@H](O)c2c(C1)nc(C1CCN(CC1)c1ncc(OC(F)F)cn1)c([C@@H](F)c1ccc(cc1)C(F)(F)F)c2C1CCC(F)(F)CC1
InChI Key InChIKey=AWODGYHPIMOJLG-SVEHJYQDSA-N
Data  1 IC50
  Tab Delimited (TSV)   2D SDfile   Computed 3D by Vconf -m prep SDfile
Find this compound or compounds like it in BindingDB:
Activity Spreadsheet -- Enzyme Inhibition Constant Data from BindingDB
Found 1 hit for monomerid = 192302
TargetCholesteryl ester transfer protein(Homo sapiens (Human))
Daiichi Sankyo
US Patent
LigandPNGBDBM192302(US9187450, 48)
Affinity DataIC50:  42nMT: 2°C. Assay description: A recombinant human CETP protein (manufactured by Roar Biomedical Inc.; 4.5 ng), the acceptor lipoprotein described in (2) above (32.5 ug) and 5,5'...
In DepthDetails US Patent