BDBM192518 US9187477, 14
SMILES CC(C)NC(=O)OC1CCN(CC1)c1ccc(cc1)-c1nc2[nH]c(O[C@@H]3COC4[C@H](O)COC34)nc2cc1Cl
InChI Key
Data  1 EC50
  Tab Delimited (TSV)   2D SDfile   Computed 3D by Vconf -m prep SDfile
Find this compound or compounds like it in BindingDB:
Activity Spreadsheet -- Enzyme Inhibition Constant Data from BindingDB
Found 1 hit for monomerid = 192518
Target5'-AMP-activated protein kinase catalytic subunit alpha-1(Homo sapiens (Human))
Boehringer Ingelheim International
US Patent
LigandPNGBDBM192518(US9187477, 14)
Affinity DataEC50:  578nMpH: 7.0Assay Description:Activated AMPK complex 1 (containing alphal betalgammal ) was obtained from baculovirus expression system. The gene encoding AMPK alphal was cloned i...
In DepthDetails US Patent