BDBM19252 15-N-[2-(dimethylamino)ethyl]-16-methoxy-6-methyl-8,12-diazatetracyclo[8.8.0.0^{2,7}.0^{13,18}]octadeca-1(10),2(7),3,5,8,11,13,15,17-nonaene-5,9,15-triamine::Dibenzo[c,f][2,7]naphthyridine, 15
SMILES COc1cc2c(cc1NCCN(C)C)ncc1c(N)nc3c(C)c(N)ccc3c21
InChI Key InChIKey=CXGJOBJRHSUZAP-UHFFFAOYSA-N
Data  1 IC50
  Tab Delimited (TSV)   2D SDfile   Computed 3D by Vconf -m prep SDfile
Find this compound or compounds like it in BindingDB:
Activity Spreadsheet -- Enzyme Inhibition Constant Data from BindingDB
Found 1 hit for monomerid = 19252
Target3-phosphoinositide-dependent protein kinase 1(Homo sapiens (Human))
Wyeth Research
LigandPNGBDBM19252(15-N-[2-(dimethylamino)ethyl]-16-methoxy-6-methyl-...)
Affinity DataIC50:  2.49E+3nMpH: 7.4 T: 2°C. Assay description: A homogeneous in vitro assay based on a LANCE format was first used for high-throughput screening. Those compounds that showed the largest different...
In DepthDetails ArticlePubMed