BDBM19255 Tiazofurin Adenine Dinucleotide (TAD) Analogue, 25::[({[(2R,3S,4R,5R)-5-(6-amino-2-iodo-9H-purin-9-yl)-3,4-dihydroxyoxolan-2-yl]methoxy}(hydroxy)phosphoryl)oxy]({[(2R,3S,4R,5R)-5-(4-carbamoyl-1,3-thiazol-2-yl)-3,4-dihydroxyoxolan-2-yl]methoxy})phosphinic acid
SMILES NC(=O)c1csc(n1)[C@@H]1O[C@H](COP(O)(=O)OP(O)(=O)OC[C@H]2O[C@H]([C@H](O)[C@@H]2O)n2cnc3c(N)nc(I)nc23)[C@@H](O)[C@H]1O
InChI Key InChIKey=KVCSYIPVHMGXAI-AGNFHCMRSA-N
Data  2 KI
  Tab Delimited (TSV)   2D SDfile   Computed 3D by Vconf -m prep SDfile
Find this compound or compounds like it in BindingDB:
Activity Spreadsheet -- Enzyme Inhibition Constant Data from BindingDB
Found 2 hits for monomerid = 19255
TargetInosine-5'-monophosphate dehydrogenase 1(Homo sapiens (Human))
University Of Minnesota At Twin Citiies
LigandPNGBDBM19255(Tiazofurin Adenine Dinucleotide (TAD) Analogue, 25...)
Affinity DataKi:  19nM ΔG°:  -10.5kcal/molepH: 8.0 T: 2°C. Assay description: Inhibition assays were performed in duplicate using two different concentrations of human IMPDH type 1 (87 and 155 nM) and varying concentrations of ...
In DepthDetails ArticlePubMed
TargetInosine-5'-monophosphate dehydrogenase 2(Homo sapiens (Human))
University Of Minnesota At Twin Citiies
LigandPNGBDBM19255(Tiazofurin Adenine Dinucleotide (TAD) Analogue, 25...)
Affinity DataKi:  84nM ΔG°:  -9.65kcal/molepH: 8.0 T: 2°C. Assay description: Inhibition assays were performed in duplicate using two different concentrations of human IMPDH type 2 (33 and 66 nM) and varying concentrations of i...
In DepthDetails ArticlePubMed