BDBM192558 US9187486, 20
SMILES C[C@H]1CN(C[C@@H](N)[C@@H]1O)c1ccncc1Nc1ncc2ccc(nn12)-c1c(F)cccc1F
InChI Key InChIKey=BHBIGGOODMPQTA-OIAISFKWSA-N
Data  2 IC50
  Tab Delimited (TSV)   2D SDfile   Computed 3D by Vconf -m prep SDfile
Find this compound or compounds like it in BindingDB:
Activity Spreadsheet -- Enzyme Inhibition Constant Data from BindingDB
Found 2 hits for monomerid = 192558
TargetSerine/threonine-protein kinase pim-2(Homo sapiens (Human))
Amgen
US Patent
LigandPNGBDBM192558(US9187486, 20)
Affinity DataIC50:  0.0800nM. Assay description: The assay for the determination of Pim activity is based on the formation of phosphorylated biotinylated-BAD peptide at the Serine 112 residue (S112)...
In DepthDetails US Patent
TargetSerine/threonine-protein kinase pim-1(Homo sapiens (Human))
Amgen
US Patent
LigandPNGBDBM192558(US9187486, 20)
Affinity DataIC50:  0.0400nM. Assay description: The assay for the determination of Pim activity is based on the formation of phosphorylated biotinylated-BAD peptide at the Serine 112 residue (S112)...
In DepthDetails US Patent