BDBM192655 N’-(2-methoxyphenylmethylene)benzohydrazide (1f)
SMILES COc1ccccc1\C=N\NC(=O)c1ccccc1
InChI Key InChIKey=AIIBNESYBYQXIS-LFIBNONCSA-N
Data  3 KI
  Tab Delimited (TSV)   2D SDfile   Computed 3D by Vconf -m prep SDfile
Find this compound or compounds like it in BindingDB:
Activity Spreadsheet -- Enzyme Inhibition Constant Data from BindingDB
Found 3 hits for monomerid = 192655
TargetCathepsin L(Capra hircus (Goat))
Kurukshetra University
LigandPNGBDBM192655(N’-(2-methoxyphenylmethylene)benzohydrazide (...)
Affinity DataKi:  8.14nM ΔG°:  -11.5kcal/molepH: 5.0 T: 2°C. Assay description: The proteolytic activity was estimated at pH 5.0, 37 °C using 0.1 M acetate buffer as the incubation medium. The homogenate prepared above was incuba...
In DepthDetails ArticlePubMed
TargetCathepsin B(Capra hircus (Goat))
Kurukshetra University
LigandPNGBDBM192655(N’-(2-methoxyphenylmethylene)benzohydrazide (...)
Affinity DataKi:  830nM ΔG°:  -8.62kcal/molepH: 5.0 T: 2°C. Assay description: The proteolytic activity was estimated at pH 5.0, 37 °C using 0.1 M acetate buffer as the incubation medium. The homogenate prepared above was incuba...
In DepthDetails ArticlePubMed
TargetCathepsin H(Capra hircus (Goat))
Kurukshetra University
LigandPNGBDBM192655(N’-(2-methoxyphenylmethylene)benzohydrazide (...)
Affinity DataKi:  1.40E+3nM ΔG°:  -8.30kcal/molepH: 5.0 T: 2°C. Assay description: The proteolytic activity was estimated at pH 5.0, 37 °C using 0.1 M acetate buffer as the incubation medium. The homogenate prepared above was incuba...
In DepthDetails ArticlePubMed