BDBM192670 3-(6-methoxy-3,4-dihydroquinolin-1(2H)-yl)-1-(4-o-tolylpiperazin-1-yl)propan-1-one (6b)
SMILES COc1ccc2N(CCC(=O)N3CCN(CC3)c3ccccc3C)CCCc2c1
InChI Key InChIKey=QQGCAGRRBJCDSP-UHFFFAOYSA-N
Data  2 IC50
  Tab Delimited (TSV)   2D SDfile   Computed 3D by Vconf -m prep SDfile
Find this compound or compounds like it in BindingDB:
Activity Spreadsheet -- Enzyme Inhibition Constant Data from BindingDB
Found 2 hits for monomerid = 192670
TargetReverse transcriptase(Human immunodeficiency virus 1)
Wuhan University Of Technology
Curated by ChEMBL
LigandPNGBDBM192670(3-(6-methoxy-3,4-dihydroquinolin-1(2H)-yl)-1-(4-o-...)
Affinity DataIC50:  1.24E+4nM. Assay description: Inhibition of HIV-1 reverse transcriptase after 1 hr by ELISA
In DepthDetails ArticlePubMed
TargetGag-Pol polyprotein(Human immunodeficiency virus type 1 group M subtyp...)
Birla Institute Of Technology
LigandPNGBDBM192670(3-(6-methoxy-3,4-dihydroquinolin-1(2H)-yl)-1-(4-o-...)
Affinity DataIC50:  1.25E+4nM. Assay description: The reaction mixture was set with template primer complex, RT enzyme and dNTPs in a lysis buffer with or without inhibitors. The reaction mixture was...
In DepthDetails ArticlePubMed