BDBM192677 1-(4-(2-chlorophenyl)piperazin-1-yl)-3-(6-methoxy-3,4-dihydroquinolin-1(2H)-yl)propan-1-one (6i)
SMILES COc1ccc2N(CCC(=O)N3CCN(CC3)c3ccccc3Cl)CCCc2c1
InChI Key InChIKey=FIYRVSHKDPNGDQ-UHFFFAOYSA-N
Data  1 IC50
  Tab Delimited (TSV)   2D SDfile   Computed 3D by Vconf -m prep SDfile
Find this compound or compounds like it in BindingDB:
Activity Spreadsheet -- Enzyme Inhibition Constant Data from BindingDB
Found 1 hit for monomerid = 192677
TargetGag-Pol polyprotein(Human immunodeficiency virus type 1 group M subtyp...)
Birla Institute Of Technology
LigandPNGBDBM192677(1-(4-(2-chlorophenyl)piperazin-1-yl)-3-(6-methoxy-...)
Affinity DataIC50:  3.29E+4nM. Assay description: The reaction mixture was set with template primer complex, RT enzyme and dNTPs in a lysis buffer with or without inhibitors. The reaction mixture was...
In DepthDetails ArticlePubMed