BDBM192750 KIRA analog, 32
SMILES CC1(CC1)c1nc(-c2ccc(NC(=O)OCC(=O)c3ccccc3)c3ccccc23)c2c(N)nccn12
InChI Key InChIKey=CCPNEDRMBHGKRD-UHFFFAOYSA-N
Data  2 IC50
  Tab Delimited (TSV)   2D SDfile   Computed 3D by Vconf -m prep SDfile
Find this compound or compounds like it in BindingDB:
Activity Spreadsheet -- Enzyme Inhibition Constant Data from BindingDB
Found 2 hits for monomerid = 192750
TargetSerine/threonine-protein kinase/endoribonuclease IRE1 [547-977](Homo sapiens (Human))
University Of Washington
LigandPNGBDBM192750(KIRA analog, 32)
Affinity DataIC50:  6.00E+4nM. Assay description: 5′-Carboxyfluorescein (FAM)- and 3′-Black Hole Quencher (BHQ)-labeled XBP1 single stemloop mini-substrate (5′FAM-CUGAGUCCGCAGCACUCA...
In DepthDetails ArticlePubMed
TargetSerine/threonine-protein kinase/endoribonuclease IRE1 [547-977](Homo sapiens (Human))
University Of Washington
LigandPNGBDBM192750(KIRA analog, 32)
Affinity DataIC50:  5.00E+4nMpH: 7.5Assay Description:Inhibitors (initial concentration 10 or 60 μM, three-fold serial dilutions) were incubated with IRE1α* in cleavage buffer (20 mM HEPES at p...
In DepthDetails ArticlePubMed