BDBM192754 PRT062607
SMILES N[C@H]1CCCCC1Nc1ncc(C(N)=O)c(Nc2cccc(c2)-n2nccn2)n1
InChI Key InChIKey=TXGKRVFSSHPBAJ-VYRBHSGPSA-N
Data  1 IC50
  Tab Delimited (TSV)   2D SDfile   Computed 3D by Vconf -m prep SDfile
Find this compound or compounds like it in BindingDB:
Activity Spreadsheet -- Enzyme Inhibition Constant Data from BindingDB
Found 1 hit for monomerid = 192754
TargetSerine/threonine-protein kinase/endoribonuclease IRE1 [547-977](Homo sapiens (Human))
University Of Washington
LigandPNGBDBM192754(PRT062607)
Affinity DataIC50:  920nMpH: 7.5Assay Description:Inhibitors (initial concentration 10 or 60 μM, three-fold serial dilutions) were incubated with IRE1α* in cleavage buffer (20 mM HEPES at p...
In DepthDetails ArticlePubMed