BDBM19299 2-amino-N-[(1R)-1-{4-[(4-ethylphenyl)methyl]-5-(2-phenylethyl)-4H-1,2,4-triazol-3-yl}-2-(1H-indol-3-yl)ethyl]acetamide::Trisubstituted 1,2,4-Triazole, 7
SMILES CCc1ccc(Cn2c(CCc3ccccc3)nnc2[C@@H](Cc2c[nH]c3ccccc23)NC(=O)CN)cc1
InChI Key InChIKey=FLMXGJYIFYQORQ-MUUNZHRXSA-N
Data  1 IC50
  Tab Delimited (TSV)   2D SDfile   Computed 3D by Vconf -m prep SDfile
Find this compound or compounds like it in BindingDB:
Activity Spreadsheet -- Enzyme Inhibition Constant Data from BindingDB
Found 1 hit for monomerid = 19299
TargetGrowth hormone secretagogue receptor type 1(Homo sapiens (Human))
Cnrs
LigandPNGBDBM19299(2-amino-N-[(1R)-1-{4-[(4-ethylphenyl)methyl]-5-(2-...)
Affinity DataIC50:  759nMpH: 7.3 T: 2°C. Assay description: Specific binding was determined by incubation of membranes from GHS-R1a transfected LLC cells with 125I-His9-ghrelin in the presence of increasing co...
In DepthDetails ArticlePubMed