BDBM19319 N-[(1R)-1-{4-benzyl-5-[2-(1H-indol-3-yl)ethyl]-4H-1,2,4-triazol-3-yl}-2-(1H-indol-3-yl)ethyl]piperidine-3-carboxamide::Trisubstituted 1,2,4-Triazole, 27
SMILES O=C(N[C@H](Cc1c[nH]c2ccccc12)c1nnc(CCc2c[nH]c3ccccc23)n1Cc1ccccc1)C1CCCNC1
InChI Key InChIKey=DESJRSILBBZHEG-WPNNEGNSSA-N
Data  1 IC50  1 EC50
  Tab Delimited (TSV)   2D SDfile   Computed 3D by Vconf -m prep SDfile
Find this compound or compounds like it in BindingDB:
Activity Spreadsheet -- Enzyme Inhibition Constant Data from BindingDB
Found 1 hit for monomerid = 19319
TargetGrowth hormone secretagogue receptor type 1(Homo sapiens (Human))
Cnrs
LigandPNGBDBM19319(N-[(1R)-1-{4-benzyl-5-[2-(1H-indol-3-yl)ethyl]-4H-...)
Affinity DataIC50:  13nM EC50:  9.90nMpH: 7.3 T: 2°C. Assay description: Specific binding was determined by incubation of membranes from GHS-R1a transfected LLC cells with 125I-His9-ghrelin in the presence of increasing co...
In DepthDetails ArticlePubMed