BDBM193275 US9193762, RS-33-20
SMILES CCCCCCCCCCCCNC(=O)[C@@H]1CCCN1C(=O)[C@@H]1CCCN1C(=O)OCc1ccccc1
InChI Key InChIKey=UXCGZSXXRYECTJ-SVBPBHIXSA-N
Data  2 KI
  Tab Delimited (TSV)   2D SDfile   Computed 3D by Vconf -m prep SDfile
Find this compound or compounds like it in BindingDB:
Activity Spreadsheet -- Enzyme Inhibition Constant Data from BindingDB
Found 2 hits for monomerid = 193275
TargetLysosomal Pro-X carboxypeptidase(Homo sapiens (Human))
University Of Mississippi
US Patent
LigandPNGBDBM193275(US9193762, RS-33-20)
Affinity DataKi:  6.15E+4nM. Assay description: Briefly, rPRCP was incubated in the presence or absence of various PRCP inhibitors in HEPES-carbonated buffer containing 1 mM Ala-Pro-paranitroanilin...
In DepthDetails US Patent
TargetLysosomal Pro-X carboxypeptidase(Homo sapiens (Human))
University Of Mississippi
US Patent
LigandPNGBDBM193275(US9193762, RS-33-20)
Affinity DataKi:  6.43E+4nM. Assay description: Human pulmonary artery endothelial cells (HPAEC) were purchased from Invitrogen (Carlsbad, Calif.) and were cultured as previously described.20 The c...
In DepthDetails US Patent