BDBM193286 US9193762, RS-37-05
SMILES Clc1ccc(CNC(=O)CCCNC(=O)[C@@H]2CCCN2C(=O)OCc2ccccc2)cc1Cl
InChI Key InChIKey=FVNDKVORQMRVQU-NRFANRHFSA-N
Data  2 KI
  Tab Delimited (TSV)   2D SDfile   Computed 3D by Vconf -m prep SDfile
Find this compound or compounds like it in BindingDB:
Activity Spreadsheet -- Enzyme Inhibition Constant Data from BindingDB
Found 2 hits for monomerid = 193286
TargetLysosomal Pro-X carboxypeptidase(Homo sapiens (Human))
University Of Mississippi
US Patent
LigandPNGBDBM193286(US9193762, RS-37-05)
Affinity DataKi:  1.11E+5nM. Assay description: Briefly, rPRCP was incubated in the presence or absence of various PRCP inhibitors in HEPES-carbonated buffer containing 1 mM Ala-Pro-paranitroanilin...
In DepthDetails US Patent
TargetLysosomal Pro-X carboxypeptidase(Homo sapiens (Human))
University Of Mississippi
US Patent
LigandPNGBDBM193286(US9193762, RS-37-05)
Affinity DataKi:  4.56E+5nM. Assay description: Human pulmonary artery endothelial cells (HPAEC) were purchased from Invitrogen (Carlsbad, Calif.) and were cultured as previously described.20 The c...
In DepthDetails US Patent