BDBM193455 US9199944, 37
SMILES COc1cc(ccc1Nc1ncc(F)c(Nc2ccc(cc2OC(F)F)N2CCNCC2)n1)N1CCN(CC1)C(C)=O
InChI Key InChIKey=JOZQQHHKXSZVAP-UHFFFAOYSA-N
Data  2 IC50
  Tab Delimited (TSV)   2D SDfile   Computed 3D by Vconf -m prep SDfile
Find this compound or compounds like it in BindingDB:
Activity Spreadsheet -- Enzyme Inhibition Constant Data from BindingDB
Found 2 hits for monomerid = 193455
TargetALK tyrosine kinase receptor [L1196M](Homo sapiens (Human))
Korea Research Institute Of Chemical Technology
US Patent
LigandPNGBDBM193455(US9199944, 37)
Affinity DataIC50:  49nMT: 2°C. Assay description: In order to measure the inhibitory activity against ALK, a Grainer 96-well round type bottom plate was added with the compounds (2 μl) prepared ...
In DepthDetails US Patent
TargetALK tyrosine kinase receptor(Homo sapiens (Human))
Korea Research Institute Of Chemical Technology
US Patent
LigandPNGBDBM193455(US9199944, 37)
Affinity DataIC50:  12nMT: 2°C. Assay description: In order to measure the inhibitory activity against ALK, a Grainer 96-well round type bottom plate was added with the compounds (2 μl) prepared ...
In DepthDetails US Patent