BDBM193538 US9199947, 31
SMILES CC(C)COc1cc(F)cc(c1)-c1cccc(c1)C(CC(O)=O)c1nccs1
InChI Key InChIKey=HYURQHQFDOOKQA-UHFFFAOYSA-N
Data  1 IC50
  Tab Delimited (TSV)   2D SDfile   Computed 3D by Vconf -m prep SDfile
Find this compound or compounds like it in BindingDB:
Activity Spreadsheet -- Enzyme Inhibition Constant Data from BindingDB
Found 1 hit for monomerid = 193538
TargetLysosomal protective protein [29-480](Homo sapiens (Human))
Sanofi
US Patent
LigandPNGBDBM193538(US9199947, 31)
Affinity DataIC50:  2.31E+3nMpH: 5.5 T: 2°C. Assay description: The activated cathepsin A was diluted in assay buffer (25 mM MES, pH 5.5, containing 5 mM DTT) and mixed with the test compound (dissolved in assay b...
In DepthDetails US Patent