BDBM193542 US9199947, 35
SMILES OC(=O)CC(c1nccs1)c1cccc(c1)-c1cccc(OCc2ccccc2)c1
InChI Key InChIKey=UBBMIJGMBAYPCT-UHFFFAOYSA-N
Data  1 IC50
  Tab Delimited (TSV)   2D SDfile   Computed 3D by Vconf -m prep SDfile
Find this compound or compounds like it in BindingDB:
Activity Spreadsheet -- Enzyme Inhibition Constant Data from BindingDB
Found 1 hit for monomerid = 193542
TargetLysosomal protective protein [29-480](Homo sapiens (Human))
Sanofi
US Patent
LigandPNGBDBM193542(US9199947, 35)
Affinity DataIC50:  2.77E+3nMpH: 5.5 T: 2°C. Assay description: The activated cathepsin A was diluted in assay buffer (25 mM MES, pH 5.5, containing 5 mM DTT) and mixed with the test compound (dissolved in assay b...
In DepthDetails US Patent