BDBM193723 2-(4-(Di(1H-indol-3-yl)methyl)benzoyl)-N-(4-fluorophenyl)hydrazinecarbothioamide (6)
SMILES Fc1ccc(NC(=S)NNC(=O)c2ccc(cc2)C(c2c[nH]c3ccccc23)c2c[nH]c3ccccc23)cc1
InChI Key InChIKey=QSGIFEIYKOJPJG-UHFFFAOYSA-N
Data  2 IC50
  Tab Delimited (TSV)   2D SDfile   Computed 3D by Vconf -m prep SDfile
Find this compound or compounds like it in BindingDB:
Activity Spreadsheet -- Enzyme Inhibition Constant Data from BindingDB
Found 2 hits for monomerid = 193723
TargetBeta-glucuronidase(Homo sapiens (Human))
University Of Kwazulu-Natal
Curated by ChEMBL
LigandPNGBDBM193723(2-(4-(Di(1H-indol-3-yl)methyl)benzoyl)-N-(4-fluoro...)
Affinity DataIC50:  3.10E+3nM. Assay description: Inhibition of beta-glucuronidase (unknown origin) using p-nitrophenyl-beta-d-glucuronide as substrate after 30 mins
In DepthDetails ArticlePubMed
TargetBeta-glucuronidase(Homo sapiens (Human))
University Of Kwazulu-Natal
Curated by ChEMBL
LigandPNGBDBM193723(2-(4-(Di(1H-indol-3-yl)methyl)benzoyl)-N-(4-fluoro...)
Affinity DataIC50:  3.10E+3nM. Assay description: β-Glucuronidase activity was determined by measuring the absorbance at 405 nm of p-nitrophenol formed from the substrate by the spectrophotometr...
In DepthDetails ArticlePubMed