BDBM193761 (E)-3-((2-(quinoxalin-2-yl)hydrazono)methyl)benzene-1,2-diol (14)
SMILES Oc1cccc(\C=N\Nc2cnc3ccccc3n2)c1O
InChI Key InChIKey=UNXJYUGXNLCILS-CAOOACKPSA-N
Data  1 IC50
  Tab Delimited (TSV)   2D SDfile   Computed 3D by Vconf -m prep SDfile
Find this compound or compounds like it in BindingDB:
Activity Spreadsheet -- Enzyme Inhibition Constant Data from BindingDB
Found 1 hit for monomerid = 193761
TargetThymidine phosphorylase(Escherichia coli (Enterobacteria))
Universiti Teknologi Mara (Uitm)
LigandPNGBDBM193761((E)-3-((2-(quinoxalin-2-yl)hydrazono)methyl)benzen...)
Affinity DataIC50:  1.54E+4nMpH: 7.4 T: 2°C. Assay description: The Thymidine phosphorylase/PD-ECGF (E. coli) activity was determined by measuring the absorbance at 290 nm spectrophotometrically. In brief, total r...
In DepthDetails ArticlePubMed