BDBM193769 US9670208, Example 387 4-(3-(morpholin-2-yl)-[1,2,4]triazolo[4,3-a]pyridin-7-yl)-N-(tetrahydro-2H-pyran-4-yl)pyrimidin-2-amine
SMILES C1COC(CN1)c1nnc2cc(ccn12)-c1ccnc(NC2CCOCC2)n1
InChI Key InChIKey=WCLNPLPERFFXLR-UHFFFAOYSA-N
Data  1 IC50
  Tab Delimited (TSV)   2D SDfile   Computed 3D by Vconf -m prep SDfile
Find this compound or compounds like it in BindingDB:
Activity Spreadsheet -- Enzyme Inhibition Constant Data from BindingDB
Found 1 hit for monomerid = 193769
TargetMitogen-activated protein kinase 1 [8-360](Homo sapiens (Human))
Array Biopharma
US Patent
LigandPNGBDBM193769(US9670208, Example 387 4-(3-(morpholin-2-yl)-[1,2,...)
Affinity DataIC50:  117nMpH: 7.3Assay Description:Compounds were tested in an enzymatic assay using human ERK-2 (Mitogen Activated Kinase 1), recombinantly expressed as an n-terminal 6-His fusion pro...
Ligand InfoPC cidPC sid
In DepthDetails US Patent