BDBM193862 Coumarin-thiazole series I, 6o
SMILES C\C(=N/Nc1nc(cs1)-c1cc2ccccc2oc1=O)c1cc2ccccc2oc1=O
InChI Key InChIKey=SHACZOPKNHPWHV-DHRITJCHSA-N
Data  1 IC50
  Tab Delimited (TSV)   2D SDfile   Computed 3D by Vconf -m prep SDfile
Find this compound or compounds like it in BindingDB:
Activity Spreadsheet -- Enzyme Inhibition Constant Data from BindingDB
Found 1 hit for monomerid = 193862
TargetAldo-keto reductase family 1 member A1(Bos taurus (Cattle))
Comsats Institute Of Information Technology
LigandPNGBDBM193862(Coumarin-thiazole series I, 6o)
Affinity DataIC50:  8.91E+3nMpH: 6.2Assay Description:The assay results were obtained at 340 nm and ALR1 inhibitory activity was measured with the absorbance change at this respective wavelength. Each we...
In DepthDetails ArticlePubMed