BDBM193879 2-[2-(2,4-Dichlorobenzyl)-6-nitro-1H-benzimidazol-1-yl]acetohydrazide (4b)
SMILES NNC(=O)Cn1c(Cc2ccc(Cl)cc2Cl)nc2ccc(cc12)[N+]([O-])=O
InChI Key InChIKey=ZJBXYWMFLYWURF-UHFFFAOYSA-N
Data  1 IC50
  Tab Delimited (TSV)   2D SDfile   Computed 3D by Vconf -m prep SDfile
Find this compound or compounds like it in BindingDB:
Activity Spreadsheet -- Enzyme Inhibition Constant Data from BindingDB
Found 1 hit for monomerid = 193879
TargetMannosyl-oligosaccharide glucosidase(Saccharomyces cerevisiae (Yeast))
Recep Tayyip Erdogan University
LigandPNGBDBM193879(2-[2-(2,4-Dichlorobenzyl)-6-nitro-1H-benzimidazol-...)
Affinity DataIC50:  1.05E+4nMpH: 6.8Assay Description:α-Glucosidase inhibition assay was performed spectrophotometrically. α-Glucosidase from Saccharomyces cerevisiae (Sigma-Aldrich) was dissol...
In DepthDetails ArticlePubMed