BDBM194195 US9200001, 111
SMILES COc1nc(cc(n1)-n1nc(C)nc1C)[C@H]1C[C@@H]1c1nc2ccccc2n1C
InChI Key InChIKey=GUBVGXQAPYZWDC-KBPBESRZSA-N
Data  1 KI
  Tab Delimited (TSV)   2D SDfile   Computed 3D by Vconf -m prep SDfile
Find this compound or compounds like it in BindingDB:
Activity Spreadsheet -- Enzyme Inhibition Constant Data from BindingDB
Found 1 hit for monomerid = 194195
LigandPNGBDBM194195(US9200001, 111)
Affinity DataKi:  1.30nM. Assay description: In a typical experiment the PDE10 inhibitory activity of the compounds of the present invention was determined in accordance with the following exp...
In DepthDetails US Patent