BDBM194469 US9200016, 151::US9902710, Compound 151
SMILES COc1cc2cncc(Cc3ccc4oc(nc4c3)-c3cccc(CO)c3)c2cc1OC
InChI Key InChIKey=PTHWXJMHUUCICG-UHFFFAOYSA-N
Data  2 IC50
  Tab Delimited (TSV)   2D SDfile   Computed 3D by Vconf -m prep SDfile
Find this compound or compounds like it in BindingDB:
Activity Spreadsheet -- Enzyme Inhibition Constant Data from BindingDB
Found 2 hits for monomerid = 194469
TargetcAMP and cAMP-inhibited cGMP 3',5'-cyclic phosphodiesterase 10A(Homo sapiens (Human))
Exonhit Therapeutics
US Patent
LigandPNGBDBM194469(US9200016, 151 | US9902710, Compound 151)
Affinity DataIC50:  28nM. Assay description: The phosphodiesterase assay was developed using the LANCE® cAMP kit (PerkinElmer). The assay buffer contained HBSS with 5 mM HEPES, 0.1% BSA, and 1.5...
In DepthDetails US Patent
TargetcAMP and cAMP-inhibited cGMP 3',5'-cyclic phosphodiesterase 10A(Homo sapiens (Human))
Exonhit Therapeutics
US Patent
LigandPNGBDBM194469(US9200016, 151 | US9902710, Compound 151)
Affinity DataIC50:  28nMpH: 7.4 T: 2°C. Assay description: The phosphodiesterase assay was developed using the LANCE cAMP kit (PerkinElmer). The assay buffer contained HBSS with 5 mM HEPES, 0.1% BSA, and 1....
In DepthDetails US Patent