BDBM194709 US10174030, Example 95::US10717737, Example 95::US11247992, Example 95::US9670210, Example 95 1-{[4-[(cyclohexyloxy)methyl]-4-({[(1R,2S)-2-phenylcyclopropyl]amino}methyl)piperidin-1-yl]methyl}cyclobutanecarboxylic acid
SMILES OC(=O)C1(CN2CCC(CN[C@@H]3CC3c3ccccc3)(COC3CCCCC3)CC2)CCC1
InChI Key InChIKey=IJWMKGNGHJPQRQ-WUBHUQEYSA-N
Data  4 IC50
  Tab Delimited (TSV)   2D SDfile   Computed 3D by Vconf -m prep SDfile
Find this compound or compounds like it in BindingDB:
Activity Spreadsheet -- Enzyme Inhibition Constant Data from BindingDB
Found 4 hits for monomerid = 194709
TargetLysine-specific histone demethylase 1A(Homo sapiens (Human))
Incyte
US Patent
LigandPNGBDBM194709(US10174030, Example 95 | US10717737, Example 95 | ...)
Affinity DataIC50: <100nMpH: 7.5Assay Description:LANCE LSD1/KDM1A demethylase assay-10 μL of 1 nM LSD-1 enzyme (ENZO BML-SE544-0050) in the assay buffer (50 mM Tris, pH 7.5, 0.01% Tween-20, 25 ...
Ligand InfoPC cidPC sid
In DepthDetails US Patent
TargetLysine-specific histone demethylase 1A(Homo sapiens (Human))
Incyte
US Patent
LigandPNGBDBM194709(US10174030, Example 95 | US10717737, Example 95 | ...)
Affinity DataIC50: <100nM. Assay description: LANCE LSD1/KDM1A demethylase assay—10 μL of 1 nM LSD-1 enzyme (ENZO BML-SE544-0050) in the assay buffer (50 mM Tris, pH 7.5, 0.01% Tween-20, 25 ...
Ligand InfoPC cidPC sid
In DepthDetails US Patent
TargetLysine-specific histone demethylase 1A(Homo sapiens (Human))
Incyte
US Patent
LigandPNGBDBM194709(US10174030, Example 95 | US10717737, Example 95 | ...)
Affinity DataIC50: <100nM. Assay description: LANCE LSD1/KDM1A demethylase assay—10 μL of 1 nM LSD-1 enzyme (ENZO BML-SE544-0050) in the assay buffer (50 mM Tris, pH 7.5, 0.01% Tween-20, 25 ...
Ligand InfoPC cidPC sid
In DepthDetails US Patent
TargetLysine-specific histone demethylase 1A(Homo sapiens (Human))
Incyte
US Patent
LigandPNGBDBM194709(US10174030, Example 95 | US10717737, Example 95 | ...)
Affinity DataIC50: <100nM. Assay description: LANCE LSD1/KDM1A demethylase assay-10 μL of 1 nM LSD-1 enzyme (ENZO BML-SE544-0050) in the assay buffer (50 mM Tris, pH 7.5, 0.01% Tween-20, 25 ...
Ligand InfoPC cidPC sid
In DepthDetails US Patent