BDBM194817 US9206167, 39::USRE48059, Compound of Example 39
SMILES Oc1ccc2ccn(CCCCN3CCN(CC3)c3cccc4sccc34)c(=O)c2c1
InChI Key InChIKey=RHGQBJJYWPWFSG-UHFFFAOYSA-N
Data  4 KI
  Tab Delimited (TSV)   2D SDfile   Computed 3D by Vconf -m prep SDfile
Find this compound or compounds like it in BindingDB:
Activity Spreadsheet -- Enzyme Inhibition Constant Data from BindingDB
Found 4 hits for monomerid = 194817
TargetD(2) dopamine receptor(Rattus norvegicus (rat))
Otsuka Pharmaceutical
US Patent
LigandPNGBDBM194817(US9206167, 39 | USRE48059, Compound of Example 39)
Affinity DataKi:  1.20nM. Assay description: Dopamine D2: The binding assay was performed using 40 μl of the membrane specimen, 20 μl of [3H]-raclopride (final concentration 1 to 2 nM)...
Ligand InfoPC cidPC sid
In DepthDetails US Patent
TargetD(2) dopamine receptor(Rattus norvegicus (rat))
Otsuka Pharmaceutical
US Patent
LigandPNGBDBM194817(US9206167, 39 | USRE48059, Compound of Example 39)
Affinity DataKi:  1.20nM ΔG°:  -12.2kcal/molepH: 7.4 T: 2°C. Assay description: The assay was performed according to the method by Kohler et al. (Kohler C, Hall H, Ogren S O and Gawell L, Specific in vitro and in vivo binding of ...
Ligand InfoPC cidPC sid
In DepthDetails US Patent
Target5-hydroxytryptamine receptor 2A(Rattus norvegicus (rat))
Otsuka Pharmaceutical
US Patent
LigandPNGBDBM194817(US9206167, 39 | USRE48059, Compound of Example 39)
Affinity DataKi:  2.10nM. Assay description: 5-HT2A: The binding assay was performed using 40 μl of the membrane specimen, 20 μl of [3H]-Ketanserin (final concentration 1 to 3 nM), 20 ...
Ligand InfoPC cidPC sid
In DepthDetails US Patent
Target5-hydroxytryptamine receptor 2A(Rattus norvegicus (rat))
Otsuka Pharmaceutical
US Patent
LigandPNGBDBM194817(US9206167, 39 | USRE48059, Compound of Example 39)
Affinity DataKi:  2.10nM ΔG°:  -12.3kcal/molepH: 7.4 T: 2°C. Assay description: The assay was performed according to the method by Leysen J E et al. (Leysen J E, Niemegeers C J E, Van Nueten J M and Laduron P M. [3H] Ketanserin (...
Ligand InfoPC cidPC sid
In DepthDetails US Patent