BDBM194965 US9206198, 20
SMILES CO[C@@H](CN1C2CCC1CC1(CCN(C1=O)C1=C(C)C(=O)OC1)C2)c1ccc2C(=O)OCc2c1C
InChI Key InChIKey=PCOXOYROLNREJL-HQMYDANJSA-N
Data  1 IC50
  Tab Delimited (TSV)   2D SDfile   Computed 3D by Vconf -m prep SDfile
Find this compound or compounds like it in BindingDB:
Activity Spreadsheet -- Enzyme Inhibition Constant Data from BindingDB
Found 1 hit for monomerid = 194965
TargetATP-sensitive inward rectifier potassium channel 1(Homo sapiens (Human))
Merck Sharp & Dohme
US Patent
LigandPNGBDBM194965(US9206198, 20)
Affinity DataIC50:  10nMT: 2°C. Assay description: The ROMK channel functional thallium flux assay is performed in 384 wells, using the FLIPR-Tetra instrument. HEK-hKir1.1 cells are seeded in Poly-D...
Ligand InfoPC cidPC sid
In DepthDetails US Patent