BDBM195005 US9206198, 66
SMILES CCC1CC2(CCN(C[C@H](O)c3ccc4C(=O)OCc4c3C)CC2)C(=O)N1C1=CC(=O)OC1
InChI Key InChIKey=OGTISSLCALEKCM-MRNPHLECSA-N
Data  2 IC50
  Tab Delimited (TSV)   2D SDfile   Computed 3D by Vconf -m prep SDfile
Find this compound or compounds like it in BindingDB:
Activity Spreadsheet -- Enzyme Inhibition Constant Data from BindingDB
Found 2 hits for monomerid = 195005
TargetATP-sensitive inward rectifier potassium channel 1(Homo sapiens (Human))
Merck Sharp & Dohme
US Patent
LigandPNGBDBM195005(US9206198, 66)
Affinity DataIC50:  20nMpH: 7.4 T: 2°C. Assay description: Block of Kir1.1 (ROMK1) currents was examined by whole cell voltage clamp (Hamill et. al. Pfluegers Archives 391:85-100 (1981)) using the IonWorks ...
Ligand InfoPC cidPC sid
In DepthDetails US Patent
TargetATP-sensitive inward rectifier potassium channel 1(Homo sapiens (Human))
Merck Sharp & Dohme
US Patent
LigandPNGBDBM195005(US9206198, 66)
Affinity DataIC50:  10nMT: 2°C. Assay description: The ROMK channel functional thallium flux assay is performed in 384 wells, using the FLIPR-Tetra instrument. HEK-hKir1.1 cells are seeded in Poly-D...
Ligand InfoPC cidPC sid
In DepthDetails US Patent