BDBM195130 US10336717, Compound 190::US9212153, 190,Ex. 151
SMILES COC1CCC2(Cc3ccc(cc3C22N=C(N)N(C)C2=O)-c2ccnc(OC)c2)CC1
InChI Key InChIKey=WRMCIPDJJHVWPU-UHFFFAOYSA-N
Data  2 IC50
  Tab Delimited (TSV)   2D SDfile   Computed 3D by Vconf -m prep SDfile
Find this compound or compounds like it in BindingDB:
Activity Spreadsheet -- Enzyme Inhibition Constant Data from BindingDB
Found 2 hits for monomerid = 195130
TargetBeta-secretase 1(Homo sapiens (Human))
Vitae Pharmaceuticals
US Patent
LigandPNGBDBM195130(US10336717, Compound 190 | US9212153, 190,Ex. 151)
Affinity DataIC50:  10.5nM. Assay description: For each compound being tested, the BACE activity was monitored in a fluorescence quenching assay (FRET) using the ectodomain of BACE (aa 1-454) fuse...
Ligand InfoPC cidPC sid
In DepthDetails US Patent
TargetBeta-secretase 1 [1-458](Homo sapiens (Human))
Vitae Pharmaceuticals
US Patent
LigandPNGBDBM195130(US10336717, Compound 190 | US9212153, 190,Ex. 151)
Affinity DataIC50:  10.5nMpH: 4.4Assay Description:For each compound being tested, the BACE activity was monitored in a fluorescence quenching assay (FRET) using the ectodomain of BACE (aa 1-454) fuse...
Ligand InfoPC cidPC sid
In DepthDetails US Patent