BDBM195194 US9670212, 20 N,N'-dimethyl-N-[8-methyl-3-({[4-(methyloxy)phenyl]amino}methyl)quinolin-2-yl]ethane-1,2-diamine
SMILES CNCCN(C)c1nc2c(C)cccc2cc1CNc1ccc(OC)cc1
InChI Key InChIKey=DZSGPZIDZSZQNB-UHFFFAOYSA-N
Data  1 IC50
  Tab Delimited (TSV)   2D SDfile   Computed 3D by Vconf -m prep SDfile
Find this compound or compounds like it in BindingDB:
Activity Spreadsheet -- Enzyme Inhibition Constant Data from BindingDB
Found 1 hit for monomerid = 195194
LigandPNGBDBM195194(US9670212, 20 N,N'-dimethyl-N-[8-methyl-3-({[4-(me...)
Affinity DataIC50:  1.00E+3nM. Assay description: Kinase activity is measured as the percent of ATP consumed following the kinase reaction using luciferase-luciferin-coupled chemiluminescence. Reacti...
Ligand InfoPC cidPC sid
In DepthDetails US Patent