BDBM195257 US9212153, 321,Ex. 270
SMILES CCC(C)N1C(N)=NC2(C1=O)c1cc(ccc1CC21CCC(CC1)OC)C#CC1CC1
InChI Key InChIKey=GJSSQXCUVKIECA-UHFFFAOYSA-N
Data  1 IC50
  Tab Delimited (TSV)   2D SDfile   Computed 3D by Vconf -m prep SDfile
Find this compound or compounds like it in BindingDB:
Activity Spreadsheet -- Enzyme Inhibition Constant Data from BindingDB
Found 1 hit for monomerid = 195257
TargetBeta-secretase 1 [1-458](Homo sapiens (Human))
Vitae Pharmaceuticals
US Patent
LigandPNGBDBM195257(US9212153, 321,Ex. 270)
Affinity DataIC50:  22.2nMpH: 4.4Assay Description:For each compound being tested, the BACE activity was monitored in a fluorescence quenching assay (FRET) using the ectodomain of BACE (aa 1-454) fuse...
Ligand InfoPC cidPC sid
In DepthDetails US Patent