BDBM195342 US9212153, 425,Ex. 362
SMILES CN1C(N)NC2(C1=O)c1cc(OCC3CC3)ccc1OC21CCc2ccccc2CC1
InChI Key InChIKey=TWHWYAHQBVYGMP-UHFFFAOYSA-N
Data  1 IC50
  Tab Delimited (TSV)   2D SDfile   Computed 3D by Vconf -m prep SDfile
Find this compound or compounds like it in BindingDB:
Activity Spreadsheet -- Enzyme Inhibition Constant Data from BindingDB
Found 1 hit for monomerid = 195342
TargetBeta-secretase 1 [1-458](Homo sapiens (Human))
Vitae Pharmaceuticals
US Patent
LigandPNGBDBM195342(US9212153, 425,Ex. 362)
Affinity DataIC50:  4.10nMpH: 4.4Assay Description:For each compound being tested, the BACE activity was monitored in a fluorescence quenching assay (FRET) using the ectodomain of BACE (aa 1-454) fuse...
Ligand InfoPC cidPC sid
In DepthDetails US Patent