BDBM195407 US9670212, 56 3-amino-N-[(3-{2-[(dimethylamino)carbonyl]phenyl}quinolin-2-yl)methyl]pyrazine-2-carboxamide
SMILES CN(C)C(=O)c1ccccc1-c1cc2ccccc2nc1CNC(=O)c1nccnc1N
InChI Key InChIKey=VRJHADSMIYVJQZ-UHFFFAOYSA-N
Data  1 IC50
  Tab Delimited (TSV)   2D SDfile   Computed 3D by Vconf -m prep SDfile
Find this compound or compounds like it in BindingDB:
Activity Spreadsheet -- Enzyme Inhibition Constant Data from BindingDB
Found 1 hit for monomerid = 195407
LigandPNGBDBM195407(US9670212, 56 3-amino-N-[(3-{2-[(dimethylamino)car...)
Affinity DataIC50:  375nM. Assay description: Kinase activity is measured as the percent of ATP consumed following the kinase reaction using luciferase-luciferin-coupled chemiluminescence. Reacti...
Ligand InfoPC cidPC sid
In DepthDetails US Patent